BDBM50013496 2-[16-azatetracyclo[7.6.1.02,7.010,15]hexadeca-2(7),3,5,10,12,14-hexaen-1-yl]-1-ethanamine::CHEMBL10710
SMILES NCCC12NC(Cc3ccccc13)c1ccccc21
InChI Key InChIKey=FRGNWIPYAKQYQL-UHFFFAOYSA-N
Data  1 KI
  Tab Delimited (TSV)   2D SDfile   Computed 3D by Vconf -m prep SDfile
Find this compound or compounds like it in BindingDB:
Activity Spreadsheet -- Enzyme Inhibition Constant Data from BindingDB
Found 1 hit for monomerid = 50013496
TargetGlutamate receptor ionotropic, NMDA 1(RAT)
National Institute Of Diabetes And Digestive And Kidney Diseases
Curated by ChEMBL
LigandPNGBDBM50013496(2-[16-azatetracyclo[7.6.1.02,7.010,15]hexadeca-2(7...)
Affinity DataKi:  20nM. Assay description: Ability to displace [3H]TCP from high affinity PCP N-methyl-D-aspartate glutamate receptor in rat brain homogenatesin vitro was determined
In DepthDetails ArticlePubMed