BDBM50013516 2-{4-[2-(1H-Tetrazol-5-yl)-ethyl]-phenoxymethyl}-quinoline::CHEMBL18177
SMILES C(Cc1ccc(OCc2ccc3ccccc3n2)cc1)c1nnn[nH]1
InChI Key InChIKey=IIHHSWYDPCUBAX-UHFFFAOYSA-N
Data  1 KI  1 IC50
  Tab Delimited (TSV)   2D SDfile   Computed 3D by Vconf -m prep SDfile
Find this compound or compounds like it in BindingDB:
Activity Spreadsheet -- Enzyme Inhibition Constant Data from BindingDB
Found 2 hits for monomerid = 50013516
TargetCysteinyl leukotriene receptor 1(GUINEA PIG)
Rorer Central Research
Curated by ChEMBL
LigandPNGBDBM50013516(2-{4-[2-(1H-Tetrazol-5-yl)-ethyl]-phenoxymethyl}-q...)
Affinity DataKi:  160nM. Assay description: Binding affinity against Cysteinyl leukotriene D4 receptor from guinea pig lung was determined using [3H]-LTD4 (0.2 nM)
In DepthDetails ArticlePubMed
TargetCysteinyl leukotriene receptor 1/2(Homo sapiens (Human))
Rorer Central Research
Curated by ChEMBL
LigandPNGBDBM50013516(2-{4-[2-(1H-Tetrazol-5-yl)-ethyl]-phenoxymethyl}-q...)
Affinity DataIC50:  280nM. Assay description: Inhibition of the spasmogenic activity of LTD4 in guinea pig parenchymal strips.
In DepthDetails ArticlePubMed