BDBM50013538 4-[3-(Quinolin-2-ylmethoxy)-phenoxy]-butyric acid::CHEMBL18471
SMILES OC(=O)CCCOc1cccc(OCc2ccc3ccccc3n2)c1
InChI Key InChIKey=HYTBIVFDTLBKQS-UHFFFAOYSA-N
Data  2 KI  1 IC50
  Tab Delimited (TSV)   2D SDfile   Computed 3D by Vconf -m prep SDfile
Find this compound or compounds like it in BindingDB:
Activity Spreadsheet -- Enzyme Inhibition Constant Data from BindingDB
Found 3 hits for monomerid = 50013538
TargetCysteinyl leukotriene receptor 1(GUINEA PIG)
Rorer Central Research
Curated by ChEMBL
LigandPNGBDBM50013538(4-[3-(Quinolin-2-ylmethoxy)-phenoxy]-butyric acid ...)
Affinity DataKi:  130nM. Assay description: Binding affinity against Cysteinyl leukotriene D4 receptor from guinea pig lung was determined using [3H]-LTD4 (0.2 nM)
In DepthDetails ArticlePubMed
TargetCysteinyl leukotriene receptor 1/2(Homo sapiens (Human))
Rorer Central Research
Curated by ChEMBL
LigandPNGBDBM50013538(4-[3-(Quinolin-2-ylmethoxy)-phenoxy]-butyric acid ...)
Affinity DataKi:  130nM. Assay description: In vitro binding affinity against cysteinyl leukotriene D4 receptor from guinea pig lung membrane
In DepthDetails ArticlePubMed
TargetCysteinyl leukotriene receptor 1/2(Homo sapiens (Human))
Rorer Central Research
Curated by ChEMBL
LigandPNGBDBM50013538(4-[3-(Quinolin-2-ylmethoxy)-phenoxy]-butyric acid ...)
Affinity DataIC50:  240nM. Assay description: Inhibition of the spasmogenic activity of LTD4 in guinea pig parenchymal strips.
In DepthDetails ArticlePubMed