BDBM50013570 7-Chloro-2-(2-{4-[2-(1H-tetrazol-5-ylmethyl)-benzyloxy]-phenyl}-vinyl)-quinoline::CHEMBL428868
SMILES Clc1ccc2ccc(C=Cc3ccc(OCc4ccccc4Cc4nnn[nH]4)cc3)nc2c1
InChI Key InChIKey=MSFARNRRDBGRCG-UHFFFAOYSA-N
Data  1 KI
  Tab Delimited (TSV)   2D SDfile   Computed 3D by Vconf -m prep SDfile
Find this compound or compounds like it in BindingDB:
Activity Spreadsheet -- Enzyme Inhibition Constant Data from BindingDB
Found 1 hit for monomerid = 50013570
TargetCysteinyl leukotriene receptor 1(GUINEA PIG)
Rorer Central Research
Curated by ChEMBL
LigandPNGBDBM50013570(7-Chloro-2-(2-{4-[2-(1H-tetrazol-5-ylmethyl)-benzy...)
Affinity DataKi:  2.5nM. Assay description: Binding affinity against Cysteinyl leukotriene D4 receptor from guinea pig lung was determined using [3H]-LTD4 (0.2 nM)
In DepthDetails ArticlePubMed