BDBM50013683 CHEMBL3264518
SMILES CCOC(=O)c1c(oc2ccc(Oc3ccccc3)cc12)-c1ccccc1
InChI Key InChIKey=YFFAOTPADVEMBQ-UHFFFAOYSA-N
Data  2 IC50
  Tab Delimited (TSV)   2D SDfile   Computed 3D by Vconf -m prep SDfile
Find this compound or compounds like it in BindingDB:
Activity Spreadsheet -- Enzyme Inhibition Constant Data from BindingDB
Found 2 hits for monomerid = 50013683
TargetProstaglandin G/H synthase 2(Homo sapiens (Human))
Banaras Hindu University
Curated by ChEMBL
LigandPNGBDBM50013683(CHEMBL3264518)
Affinity DataIC50:  1.82E+4nM. Assay description: Inhibition of human recombinant COX-2 expressed in insect cell system using arachidonic acid as substrate assessed as reduction of PGG2 to PGH2 incub...
In DepthDetails ArticlePubMed
TargetProstaglandin G/H synthase 1(RAT)
Banaras Hindu University
Curated by ChEMBL
LigandPNGBDBM50013683(CHEMBL3264518)
Affinity DataIC50:  4.25E+4nM. Assay description: Inhibition of rat seminal vesicle COX-1 using arachidonic acid as substrate assessed as reduction of PGG2 to PGH2 incubated for 1 min prior to substr...
In DepthDetails ArticlePubMed