BDBM50013763 (S)-19-(1-isothiocyanatoethyl)-15-methoxy-3-methyl-13-oxa-3-azahexacyclo[13.2.2.12,8.01,6.06,14.07,12]icosa-7,9,11,16-tetraen-11-ol::CHEMBL3038197
SMILES [H][C@@]12Oc3c4c(C[C@@]5([H])N(C)CC[C@@]14[C@]51CC([C@H](C)N=C=S)[C@]2(OC)C=C1)ccc3O
InChI Key InChIKey=WTVMVUJOBOGEOT-MOEIEMDKSA-N
Data  1 IC50
  Tab Delimited (TSV)   2D SDfile   Computed 3D by Vconf -m prep SDfile
Find this compound or compounds like it in BindingDB:
Activity Spreadsheet -- Enzyme Inhibition Constant Data from BindingDB
Found 1 hit for monomerid = 50013763
TargetMu-type opioid receptor(CALF)
University Of Washington
Curated by ChEMBL
LigandPNGBDBM50013763((S)-19-(1-isothiocyanatoethyl)-15-methoxy-3-methyl...)
Affinity DataIC50:  6.20nM. Assay description: Inhibition of 0.5 nM [3H]- Bremazocine binding to Opioid receptor mu 1 of bovine striatum membrane
In DepthDetails ArticlePubMed