BDBM50013903 CHEMBL3260489
SMILES CNC(=O)c1cccc2n(ccc12)-c1cc(C(=O)N2Cc3ccccc3C2)c(O)cc1O
InChI Key InChIKey=KKPKKLMXEDMPFO-UHFFFAOYSA-N
Data  1 IC50
  Tab Delimited (TSV)   2D SDfile   Computed 3D by Vconf -m prep SDfile
Find this compound or compounds like it in BindingDB:
Activity Spreadsheet -- Enzyme Inhibition Constant Data from BindingDB
Found 1 hit for monomerid = 50013903
TargetHeat shock protein HSP 90-alpha(Homo sapiens (Human))
Chinese Academy Of Sciences
Curated by ChEMBL
LigandPNGBDBM50013903(CHEMBL3260489)
Affinity DataIC50:  620nM. Assay description: Displacement of GM-BODIPY from human full length HSP90 alpha expressed in baculovirus-infected Sf9 cells after 16 hrs by fluorescence polarization as...
In DepthDetails ArticlePubMed