BDBM50014080 (S)-N-[(S)-1-[(1S,2R)-1-Cyclohexylmethyl-2-((S)-3-ethyl-2-oxo-oxazolidin-5-yl)-2-hydroxy-ethylcarbamoyl]-2-(3H-imidazol-4-yl)-ethyl]-2-[3-(2-methoxymethoxy-ethyl)-3-methyl-ureido]-3-(4-methoxy-phenyl)-propionamide::CHEMBL59236
SMILES CCN1C[C@H](OC1=O)[C@H](O)[C@H](CC1CCCCC1)NC(=O)[C@H](Cc1cnc[nH]1)NC(=O)[C@H](Cc1ccc(OC)cc1)NC(=O)N(C)CCOCOC
InChI Key InChIKey=YLUIODVEQWMRRU-QEUNAIBPSA-N
Data  2 IC50
  Tab Delimited (TSV)   2D SDfile   Computed 3D by Vconf -m prep SDfile
Find this compound or compounds like it in BindingDB:
Activity Spreadsheet -- Enzyme Inhibition Constant Data from BindingDB
Found 2 hits for monomerid = 50014080
TargetRenin(Homo sapiens (Human))
Abbott Laboratories
Curated by ChEMBL
LigandPNGBDBM50014080((S)-N-[(S)-1-[(1S,2R)-1-Cyclohexylmethyl-2-((S)-3-...)
Affinity DataIC50:  27nMpH: 7.4Assay Description:Inhibitory activity against purified human renal renin at pH 6.5
In DepthDetails ArticlePubMed
TargetRenin(Homo sapiens (Human))
Abbott Laboratories
Curated by ChEMBL
LigandPNGBDBM50014080((S)-N-[(S)-1-[(1S,2R)-1-Cyclohexylmethyl-2-((S)-3-...)
Affinity DataIC50:  4.60nMpH: 6.5Assay Description:Inhibitory activity against purified human renal renin at pH 6.5
In DepthDetails ArticlePubMed