BDBM50014096 1-Acetyl-pyrrolidine-2-carboxylic acid {1-[1-{1-[(1-carbamoyl-2-phenyl-ethylamino)-methyl]-2-phenyl-ethylcarbamoyl}-2-(3H-imidazol-4-yl)-ethylcarbamoyl]-2-phenyl-ethyl}-amide(U-71909E)::CHEMBL3142167
SMILES CC(=O)N1CCC[C@H]1C(=O)N[C@@H](Cc1ccccc1)C(=O)N[C@@H](Cc1c[nH]cn1)C(=O)N[C@H](CN[C@@H](Cc1ccccc1)C(N)=O)Cc1ccccc1
InChI Key InChIKey=QDUWEZGYZYPMBL-UHFFFAOYSA-N
Data  1 Kd
  Tab Delimited (TSV)   2D SDfile   Computed 3D by Vconf -m prep SDfile
Find this compound or compounds like it in BindingDB:
Activity Spreadsheet -- Enzyme Inhibition Constant Data from BindingDB
Found 1 hit for monomerid = 50014096
TargetRenin(Homo sapiens (Human))
Upjohn
Curated by ChEMBL
LigandPNGBDBM50014096(1-Acetyl-pyrrolidine-2-carboxylic acid {1-[1-{1-[(...)
Affinity DataKd:  29nM. Assay description: Dissociation constant (Kd) of renin inhibitor was determined over a temperature range of 8-37 degree by the fluorescence displacement assay
In DepthDetails ArticlePubMed