BDBM50014108 (-)-tert-Butyl-carbamic acid 1,3a,8-trimethyl-1,2,3,3a,8,8a-hexahydro-pyrrolo[2,3-b]indol-5-yl ester::CHEMBL308503
SMILES CN1CC[C@]2(C)[C@H]1N(C)c1ccc(OC(=O)NC(C)(C)C)cc21
InChI Key InChIKey=AFSDRTXSPIZEMA-QAPCUYQASA-N
Data  5 IC50
  Tab Delimited (TSV)   2D SDfile   Computed 3D by Vconf -m prep SDfile
Find this compound or compounds like it in BindingDB:
Activity Spreadsheet -- Enzyme Inhibition Constant Data from BindingDB
Found 5 hits for monomerid = 50014108
TargetAcetylcholinesterase(Electrophorus electricus (Electric eel))
Niddk
Curated by ChEMBL
LigandPNGBDBM50014108((-)-tert-Butyl-carbamic acid 1,3a,8-trimethyl-1,2,...)
Affinity DataIC50: >1.00E+4nM. Assay description: Inhibitory activity against Acetylcholinesterase in electric eel
In DepthDetails ArticlePubMed
TargetAcetylcholinesterase(Homo sapiens (Human))
Niddk
Curated by ChEMBL
LigandPNGBDBM50014108((-)-tert-Butyl-carbamic acid 1,3a,8-trimethyl-1,2,...)
Affinity DataIC50:  3.20E+4nM. Assay description: Inhibitory activity against Acetylcholinesterase in cortex
In DepthDetails ArticlePubMed
TargetCholinesterase(Homo sapiens (Human))
Niddk
Curated by ChEMBL
LigandPNGBDBM50014108((-)-tert-Butyl-carbamic acid 1,3a,8-trimethyl-1,2,...)
Affinity DataIC50:  1.10E+4nM. Assay description: Inhibitory activity against Butyrylcholinesterase in cortex
In DepthDetails ArticlePubMed
TargetAcetylcholinesterase(Homo sapiens (Human))
Niddk
Curated by ChEMBL
LigandPNGBDBM50014108((-)-tert-Butyl-carbamic acid 1,3a,8-trimethyl-1,2,...)
Affinity DataIC50:  2.30E+4nM. Assay description: Inhibitory activity against Butyrylcholinesterase in plasma
In DepthDetails ArticlePubMed
TargetCholinesterase(Homo sapiens (Human))
Niddk
Curated by ChEMBL
LigandPNGBDBM50014108((-)-tert-Butyl-carbamic acid 1,3a,8-trimethyl-1,2,...)
Affinity DataIC50:  2.00E+3nM. Assay description: Inhibitory activity against Butyrylcholinesterase in plasma
In DepthDetails ArticlePubMed