BDBM50014163 CHEMBL3260860
SMILES Clc1cccc(Cl)c1Nc1ccccc1Cc1nn(CN2CCCCC2)c(=S)o1
InChI Key InChIKey=IOIYMIJFZBAFTJ-UHFFFAOYSA-N
Data  2 IC50
  Tab Delimited (TSV)   2D SDfile   Computed 3D by Vconf -m prep SDfile
Find this compound or compounds like it in BindingDB:
Activity Spreadsheet -- Enzyme Inhibition Constant Data from BindingDB
Found 2 hits for monomerid = 50014163
TargetProstaglandin G/H synthase 2(Ovis aries (Sheep))
K.L.E.U'S College Of Pharmacy
Curated by ChEMBL
LigandPNGBDBM50014163(CHEMBL3260860)
Affinity DataIC50:  1.50E+4nM. Assay description: Inhibition of ovine COX2 peroxidase activity assessed as reduction of PGG2 to PGH2 by measuring oxidized TMPD level by colorimetric assay
In DepthDetails ArticlePubMed
TargetProstaglandin G/H synthase 1(Ovis aries (Sheep))
K.L.E.U'S College Of Pharmacy
Curated by ChEMBL
LigandPNGBDBM50014163(CHEMBL3260860)
Affinity DataIC50: >5.00E+4nM. Assay description: Inhibition of ovine COX1 peroxidase activity assessed as reduction of PGG2 to PGH2 by measuring oxidized TMPD level by colorimetric assay
In DepthDetails ArticlePubMed