BDBM50014299 2,2,10,13-Tetramethyl-1,6,7,8,9,10,11,12,13,14,15,16-dodecahydro-2H-cyclopenta[a]phenanthrene-3,17-dione::CHEMBL421018
SMILES C[C@]12CCC3C(CCC4=CC(=O)C(C)(C)C[C@]34C)C1CCC2=O
InChI Key InChIKey=IFQGCFSQXXEGDT-UWVSKHRXSA-N
Data  1 KI
  Tab Delimited (TSV)   2D SDfile   Computed 3D by Vconf -m prep SDfile
Find this compound or compounds like it in BindingDB:
Activity Spreadsheet -- Enzyme Inhibition Constant Data from BindingDB
Found 1 hit for monomerid = 50014299
TargetAromatase(Homo sapiens (Human))
Johns Hopkins University School Of Medicine
Curated by ChEMBL
LigandPNGBDBM50014299(2,2,10,13-Tetramethyl-1,6,7,8,9,10,11,12,13,14,15,...)
Affinity DataKi:  2.30nM. Assay description: Binding affinity was measured on Cytochrome P450 19A1
In DepthDetails ArticlePubMed