BDBM50014538 CHEMBL3261419
SMILES COc1ccc(cc1)-n1ncc2c(NC[C@H](C)NS(=O)(=O)c3c(C)cc(C)cc3C)cccc12
InChI Key InChIKey=NVIAGCNCVHASTJ-FQEVSTJZSA-N
Data  1 IC50
  Tab Delimited (TSV)   2D SDfile   Computed 3D by Vconf -m prep SDfile
Find this compound or compounds like it in BindingDB:
Activity Spreadsheet -- Enzyme Inhibition Constant Data from BindingDB
Found 1 hit for monomerid = 50014538
TargetGlucocorticoid receptor(Homo sapiens (Human))
Astrazeneca
Curated by ChEMBL
LigandPNGBDBM50014538(CHEMBL3261419)
Affinity DataIC50:  5.40nM. Assay description: Binding affinity to human glucocorticoid receptor by fluorescence polarization assay
In DepthDetails ArticlePubMed