BDBM50014768 (4-Chloro-2-methoxy-phenyl)-phenyl-pyridin-3-yl-methanol::CHEMBL343273
SMILES COc1cc(Cl)ccc1C(O)(c1ccccc1)c1cccnc1
InChI Key InChIKey=VUGOEPFUNLHIBN-UHFFFAOYSA-N
Data  1 EC50
  Tab Delimited (TSV)   2D SDfile   Computed 3D by Vconf -m prep SDfile
Find this compound or compounds like it in BindingDB:
Activity Spreadsheet -- Enzyme Inhibition Constant Data from BindingDB
Found 1 hit for monomerid = 50014768
TargetAromatase(Rattus norvegicus)
Eli Lilly
Curated by ChEMBL
LigandPNGBDBM50014768((4-Chloro-2-methoxy-phenyl)-phenyl-pyridin-3-yl-me...)
Affinity DataEC50:  1.80E+3nM. Assay description: In vitro Cytochrome P450 19A1 inhibition concentration to decrease aromatization of androstenedione in rat ovarian microsome
In DepthDetails ArticlePubMed