BDBM50014771 Bis-(4-chloro-phenyl)-thiazol-5-yl-methanol::CHEMBL137552
SMILES OC(c1cncs1)(c1ccc(Cl)cc1)c1ccc(Cl)cc1
InChI Key InChIKey=PGSFCLGZKJSIPP-UHFFFAOYSA-N
Data  1 EC50
  Tab Delimited (TSV)   2D SDfile   Computed 3D by Vconf -m prep SDfile
Find this compound or compounds like it in BindingDB:
Activity Spreadsheet -- Enzyme Inhibition Constant Data from BindingDB
Found 1 hit for monomerid = 50014771
TargetAromatase(Rattus norvegicus)
Eli Lilly
Curated by ChEMBL
LigandPNGBDBM50014771(Bis-(4-chloro-phenyl)-thiazol-5-yl-methanol | CHEM...)
Affinity DataEC50:  9.60nM. Assay description: In vitro Cytochrome P450 19A1 inhibition concentration to decrease aromatization of androstenedione in rat ovarian microsome
In DepthDetails ArticlePubMed