BDBM50014793 5-[Bis-(4-chloro-phenyl)-imidazol-1-yl-methyl]-isothiazole::CHEMBL137584
SMILES Clc1ccc(cc1)C(c1ccns1)(c1ccc(Cl)cc1)n1ccnc1
InChI Key InChIKey=NINGDVQPAKVIDK-UHFFFAOYSA-N
Data  1 EC50
  Tab Delimited (TSV)   2D SDfile   Computed 3D by Vconf -m prep SDfile
Find this compound or compounds like it in BindingDB:
Activity Spreadsheet -- Enzyme Inhibition Constant Data from BindingDB
Found 1 hit for monomerid = 50014793
TargetAromatase(Rattus norvegicus)
Eli Lilly
Curated by ChEMBL
LigandPNGBDBM50014793(5-[Bis-(4-chloro-phenyl)-imidazol-1-yl-methyl]-iso...)
Affinity DataEC50:  57nM. Assay description: In vitro Cytochrome P450 19A1 inhibition concentration to decrease aromatization of androstenedione in rat ovarian microsome
In DepthDetails ArticlePubMed