BDBM50014801 4-[Bis-(4-chloro-phenyl)-methyl]-pyridine; hydrochloride::CHEMBL554619
SMILES Clc1ccc(cc1)C(c1ccncc1)c1ccc(Cl)cc1
InChI Key InChIKey=WVTMLTGHIFEUFQ-UHFFFAOYSA-N
Data  1 EC50
  Tab Delimited (TSV)   2D SDfile   Computed 3D by Vconf -m prep SDfile
Find this compound or compounds like it in BindingDB:
Activity Spreadsheet -- Enzyme Inhibition Constant Data from BindingDB
Found 1 hit for monomerid = 50014801
TargetAromatase(Rattus norvegicus)
Eli Lilly
Curated by ChEMBL
LigandPNGBDBM50014801(4-[Bis-(4-chloro-phenyl)-methyl]-pyridine; hydroch...)
Affinity DataEC50:  160nM. Assay description: In vitro Cytochrome P450 19A1 inhibition concentration to decrease aromatization of androstenedione in rat ovarian microsome
In DepthDetails ArticlePubMed