BDBM50014805 Bis-(3-chloro-phenyl)-pyridin-3-yl-methanol::CHEMBL135396
SMILES OC(c1cccnc1)(c1cccc(Cl)c1)c1cccc(Cl)c1
InChI Key InChIKey=QJMWFIKJGNIMQF-UHFFFAOYSA-N
Data  1 EC50
  Tab Delimited (TSV)   2D SDfile   Computed 3D by Vconf -m prep SDfile
Find this compound or compounds like it in BindingDB:
Activity Spreadsheet -- Enzyme Inhibition Constant Data from BindingDB
Found 1 hit for monomerid = 50014805
TargetAromatase(Rattus norvegicus)
Eli Lilly
Curated by ChEMBL
LigandPNGBDBM50014805(Bis-(3-chloro-phenyl)-pyridin-3-yl-methanol | CHEM...)
Affinity DataEC50:  4.50E+3nM. Assay description: In vitro Cytochrome P450 19A1 inhibition concentration to decrease aromatization of androstenedione in rat ovarian microsome
In DepthDetails ArticlePubMed