BDBM50014888 4-Benzoylamino-4-dipropylcarbamoyl-butyric acid::CHEMBL316561::Proglumide
SMILES CCCN(CCC)C(=O)C(CCC(O)=O)NC(=O)c1ccccc1
InChI Key InChIKey=DGMKFQYCZXERLX-UHFFFAOYSA-N
Data  1 KI  5 IC50
  Tab Delimited (TSV)   2D SDfile   Computed 3D by Vconf -m prep SDfile
Find this compound or compounds like it in BindingDB:
Activity Spreadsheet -- Enzyme Inhibition Constant Data from BindingDB
Found 6 hits for monomerid = 50014888
TargetCholecystokinin(RAT)
Merck Sharp & Dohme Research Laboratories
Curated by PDSP Ki Database
LigandPNGBDBM50014888(4-Benzoylamino-4-dipropylcarbamoyl-butyric acid | ...)
Affinity DataKi: >1.00E+4nM
In DepthDetails ArticlePubMed
TargetGastrin/cholecystokinin type B receptor(Homo sapiens (Human))
Merck Sharp & Dohme Research Laboratories
Curated by ChEMBL
LigandPNGBDBM50014888(4-Benzoylamino-4-dipropylcarbamoyl-butyric acid | ...)
Affinity DataIC50:  9.00E+5nM. Assay description: Inhibition of binding of [125I]gastrin to Cholecystokinin type B receptor from guinea pig gastric glands
In DepthDetails ArticlePubMed
TargetHistamine H2 receptor(RAT)
TBA
Curated by ChEMBL
LigandPNGBDBM50014888(4-Benzoylamino-4-dipropylcarbamoyl-butyric acid | ...)
Affinity DataIC50:  2.50E+6nM. Assay description: Inhibitory activity against binding of [125I](Nle11)-HG-13 to Histamine H2 receptor in vitro
In DepthDetails ArticlePubMed
TargetCholecystokinin receptor type A(RAT)
Merck Sharp & Dohme Research Laboratories
Curated by ChEMBL
LigandPNGBDBM50014888(4-Benzoylamino-4-dipropylcarbamoyl-butyric acid | ...)
Affinity DataIC50:  2.50E+5nM. Assay description: Inhibition of binding of [125I]- CCK-33 to rat pancreas
In DepthDetails ArticlePubMed
TargetCholecystokinin receptor type A(Cavia porcellus)
Merck Sharp & Dohme Research Laboratories
Curated by ChEMBL
LigandPNGBDBM50014888(4-Benzoylamino-4-dipropylcarbamoyl-butyric acid | ...)
Affinity DataIC50:  8.00E+5nM. Assay description: Inhibition of binding of [125I]- CCK-33 to guinea pig cortex
In DepthDetails ArticlePubMed
TargetGastrin/cholecystokinin type B receptor(Homo sapiens (Human))
Merck Sharp & Dohme Research Laboratories
Curated by ChEMBL
LigandPNGBDBM50014888(4-Benzoylamino-4-dipropylcarbamoyl-butyric acid | ...)
Affinity DataIC50:  2.50E+6nM. Assay description: In vitro inhibitory activity for binding of [125I]-(Nle11)-HG-13 to gastrin receptor on isolated rabbit gastric mucosal cells.
In DepthDetails ArticlePubMed