BDBM50014944 CHEMBL3262085
SMILES Cc1cc(C)cc(NC2=C(NS(=O)(=O)c3ccccc3)C(=O)c3c(N)cccc3C2=O)c1
InChI Key InChIKey=BOXBWUSFXFNAAI-UHFFFAOYSA-N
Data  2 IC50
  Tab Delimited (TSV)   2D SDfile   Computed 3D by Vconf -m prep SDfile
Find this compound or compounds like it in BindingDB:
Activity Spreadsheet -- Enzyme Inhibition Constant Data from BindingDB
Found 2 hits for monomerid = 50014944
TargetArylamine N-acetyltransferase 2(Mus musculus)
University Of Oxford
Curated by ChEMBL
LigandPNGBDBM50014944(CHEMBL3262085)
Affinity DataIC50:  430nM. Assay description: Inhibition of recombinant N-terminal His6-tagged mouse NAT2 expressed in Escherichia coli Rosetta(DE3)pLysS cells assessed as rate of free thiol coen...
In DepthDetails ArticlePubMed
TargetArylamine N-acetyltransferase 1(Homo sapiens (Human))
University Of Oxford
Curated by ChEMBL
LigandPNGBDBM50014944(CHEMBL3262085)
Affinity DataIC50:  540nM. Assay description: Inhibition of human NAT1 assessed as rate of free thiol coenzyme A production using arylamine and AcCoA as substrate by Ellman's method
In DepthDetails ArticlePubMed