BDBM50014992 CHEMBL3262079
SMILES Cc1cc(C)cc(NC2=C(NS(=O)(=O)c3ccccc3)C(=O)c3cc(ccc3C2=O)[N+]([O-])=O)c1
InChI Key InChIKey=VYYIPBKPMZDSHQ-UHFFFAOYSA-N
Data  1 IC50
  Tab Delimited (TSV)   2D SDfile   Computed 3D by Vconf -m prep SDfile
Find this compound or compounds like it in BindingDB:
Activity Spreadsheet -- Enzyme Inhibition Constant Data from BindingDB
Found 1 hit for monomerid = 50014992
TargetArylamine N-acetyltransferase 2(Mus musculus)
University Of Oxford
Curated by ChEMBL
LigandPNGBDBM50014992(CHEMBL3262079)
Affinity DataIC50: >3.00E+4nM. Assay description: Inhibition of recombinant N-terminal His6-tagged mouse NAT2 expressed in Escherichia coli Rosetta(DE3)pLysS cells assessed as rate of free thiol coen...
In DepthDetails ArticlePubMed