BDBM50015173 CHEMBL367924::N-Cyclohexyl-N-hydroxy-2-(4-isobutyl-phenyl)-propionamide
SMILES CC(C)Cc1ccc(cc1)C(C)C(=O)N(O)C1CCCCC1
InChI Key InChIKey=SEIYYBNFKPOMGF-UHFFFAOYSA-N
Data  2 IC50
  Tab Delimited (TSV)   2D SDfile   Computed 3D by Vconf -m prep SDfile
Find this compound or compounds like it in BindingDB:
Activity Spreadsheet -- Enzyme Inhibition Constant Data from BindingDB
Found 2 hits for monomerid = 50015173
TargetPolyunsaturated fatty acid 5-lipoxygenase(Rattus norvegicus)
Abbott Laboratories
Curated by ChEMBL
LigandPNGBDBM50015173(CHEMBL367924 | N-Cyclohexyl-N-hydroxy-2-(4-isobuty...)
Affinity DataIC50:  430nM. Assay description: Logarithmic value of inhibitory concentration against 5-lipoxygenase in rat basophilic leukemia cells (RBL-1)
In DepthDetails ArticlePubMed
TargetPolyunsaturated fatty acid 5-lipoxygenase(Rattus norvegicus)
Abbott Laboratories
Curated by ChEMBL
LigandPNGBDBM50015173(CHEMBL367924 | N-Cyclohexyl-N-hydroxy-2-(4-isobuty...)
Affinity DataIC50:  2.69E+4nM. Assay description: Logarithmic value of inhibitory concentration against 5-lipoxygenase in rat basophilic leukemia cells (RBL-1)
In DepthDetails ArticlePubMed