BDBM50015226 CHEMBL3262708
SMILES CC(=O)c1c(C)cc2cccc(OCc3ccccc3)c2c1O
InChI Key InChIKey=IXEYQUSXXQRNNI-UHFFFAOYSA-N
Data  2 IC50
  Tab Delimited (TSV)   2D SDfile   Computed 3D by Vconf -m prep SDfile
Find this compound or compounds like it in BindingDB:
Activity Spreadsheet -- Enzyme Inhibition Constant Data from BindingDB
Found 2 hits for monomerid = 50015226
TargetProstaglandin G/H synthase 2(Ovis aries (Sheep))
National Institute Of Pharmaceutical Education And Research
Curated by ChEMBL
LigandPNGBDBM50015226(CHEMBL3262708)
Affinity DataIC50:  1.12E+4nM. Assay description: Inhibition of ovine COX2 using arachidonic acid as substrate preincubated for 10 mins before substrate addition measured after 5 mins by EIA
In DepthDetails ArticlePubMed
TargetProstaglandin G/H synthase 1(Ovis aries (Sheep))
National Institute Of Pharmaceutical Education And Research
Curated by ChEMBL
LigandPNGBDBM50015226(CHEMBL3262708)
Affinity DataIC50:  1.52E+4nM. Assay description: Inhibition of ovine COX1 using arachidonic acid as substrate preincubated for 10 mins before substrate addition measured after 5 mins by EIA
In DepthDetails ArticlePubMed