BDBM50015406 4,6,7-Trimethyl-benzo[1,3]oxathiol-5-ol::CHEMBL277815
SMILES Cc1c2OCSc2c(C)c(O)c1C
InChI Key InChIKey=NKVJCXRRAWIBBG-UHFFFAOYSA-N
Data  1 IC50
  Tab Delimited (TSV)   2D SDfile   Computed 3D by Vconf -m prep SDfile
Find this compound or compounds like it in BindingDB:
Activity Spreadsheet -- Enzyme Inhibition Constant Data from BindingDB
Found 1 hit for monomerid = 50015406
TargetPolyunsaturated fatty acid 5-lipoxygenase(Homo sapiens (Human))
Sankyo
Curated by ChEMBL
LigandPNGBDBM50015406(4,6,7-Trimethyl-benzo[1,3]oxathiol-5-ol | CHEMBL27...)
Affinity DataIC50:  290nM. Assay description: Evaluated for inhibition of the formation and release of 5-lipoxygenase in isolated guinea pig ileum
In DepthDetails ArticlePubMed