BDBM50015529 4-(5-Cyclopentyloxycarbonylamino-1-methyl-1H-indol-3-ylmethyl)-3-methoxy-benzoic acid::CHEMBL298727
SMILES COc1cc(ccc1Cc1cn(C)c2ccc(NC(=O)OC3CCCC3)cc12)C(O)=O
InChI Key InChIKey=KFQBKNCZRCRBOU-UHFFFAOYSA-N
Data  2 KI
  Tab Delimited (TSV)   2D SDfile   Computed 3D by Vconf -m prep SDfile
Find this compound or compounds like it in BindingDB:
Activity Spreadsheet -- Enzyme Inhibition Constant Data from BindingDB
Found 2 hits for monomerid = 50015529
TargetCysteinyl leukotriene receptor 1(GUINEA PIG)
Goethe-University Frankfurt
Curated by ChEMBL
LigandPNGBDBM50015529(4-(5-Cyclopentyloxycarbonylamino-1-methyl-1H-indol...)
Affinity DataKi:  157nM. Assay description: Displacement of [3H]LTD4 from cysteinyl leukotriene receptor 1 in Hartley guinea pig parenchymal membrane after 30 mins by liquid scintillation count...
In DepthDetails ArticlePubMed
TargetCysteinyl leukotriene receptor 1(GUINEA PIG)
Goethe-University Frankfurt
Curated by ChEMBL
LigandPNGBDBM50015529(4-(5-Cyclopentyloxycarbonylamino-1-methyl-1H-indol...)
Affinity DataKi:  157nM. Assay description: Inhibition constant for displacement of [3H]-LTD4 on guinea pig lung parenchymal membranes.
In DepthDetails ArticlePubMed