BDBM50015867 3-Acetoxymethyl-5,5,8-trioxo-7-phenethyloxy-5lambda*6*-thia-1-aza-bicyclo[4.2.0]oct-2-ene-2-carboxylic acid tert-butyl ester::CHEMBL82320
SMILES CC(=O)OCC1=C(N2[C@@H]([C@@H](OCCc3ccccc3)C2=O)S(=O)(=O)C1)C(=O)OC(C)(C)C
InChI Key InChIKey=SAWLAWYJDWVYAY-AZUAARDMSA-N
Data  1 IC50
  Tab Delimited (TSV)   2D SDfile   Computed 3D by Vconf -m prep SDfile
Find this compound or compounds like it in BindingDB:
Activity Spreadsheet -- Enzyme Inhibition Constant Data from BindingDB
Found 1 hit for monomerid = 50015867
TargetNeutrophil elastase(Homo sapiens (Human))
Merck Sharp And Dohme Research Laboratories
Curated by ChEMBL
LigandPNGBDBM50015867(3-Acetoxymethyl-5,5,8-trioxo-7-phenethyloxy-5lambd...)
Affinity DataIC50:  5.00E+3nM. Assay description: Inhibitory concentration which is required to cause 50% inhibition of human leukocyte elastase (HLE) enzyme
In DepthDetails ArticlePubMed