BDBM50015890 3-Acetoxymethyl-7-benzoyloxy-5,5,8-trioxo-5lambda*6*-thia-1-aza-bicyclo[4.2.0]oct-2-ene-2-carboxylic acid tert-butyl ester::CHEMBL406129
SMILES CC(=O)OCC1=C(N2[C@@H]([C@@H](OC(=O)c3ccccc3)C2=O)S(=O)(=O)C1)C(=O)OC(C)(C)C
InChI Key InChIKey=CVBNTVUPTVMGTK-FUHWJXTLSA-N
Data  1 IC50
  Tab Delimited (TSV)   2D SDfile   Computed 3D by Vconf -m prep SDfile
Find this compound or compounds like it in BindingDB:
Activity Spreadsheet -- Enzyme Inhibition Constant Data from BindingDB
Found 1 hit for monomerid = 50015890
TargetNeutrophil elastase(Homo sapiens (Human))
Merck Sharp And Dohme Research Laboratories
Curated by ChEMBL
LigandPNGBDBM50015890(3-Acetoxymethyl-7-benzoyloxy-5,5,8-trioxo-5lambda*...)
Affinity DataIC50: >4.00E+4nM. Assay description: Inhibitory concentration which is required to cause 50% inhibition of human leukocyte elastase (HLE) enzyme
In DepthDetails ArticlePubMed