BDBM50015901 3-Acetoxymethyl-7-methoxy-5,5,8-trioxo-5lambda*6*-thia-1-aza-bicyclo[4.2.0]oct-2-ene-2-carboxylic acid 3-carboxy-benzyl ester::CHEMBL85563
SMILES CO[C@@H]1[C@@H]2N(C1=O)C(C(=O)OCc1cccc(c1)C(O)=O)=C(COC(C)=O)CS2(=O)=O
InChI Key InChIKey=BMJGMDJBNQVYDB-DOTOQJQBSA-N
Data  1 IC50
  Tab Delimited (TSV)   2D SDfile   Computed 3D by Vconf -m prep SDfile
Find this compound or compounds like it in BindingDB:
Activity Spreadsheet -- Enzyme Inhibition Constant Data from BindingDB
Found 1 hit for monomerid = 50015901
TargetNeutrophil elastase(Homo sapiens (Human))
Merck Sharp And Dohme Research Laboratories
Curated by ChEMBL
LigandPNGBDBM50015901(3-Acetoxymethyl-7-methoxy-5,5,8-trioxo-5lambda*6*-...)
Affinity DataIC50:  400nM. Assay description: In vitro inhibition of Human Leukocyte Elastase (HLE)
In DepthDetails ArticlePubMed