BDBM50016040 CHEMBL435076::{1-Benzyl-4-[3-(1-benzylcarbamoyl-3-methyl-butylcarbamoyl)-1-cyclohexylmethyl-2-hydroxy-propylcarbamoyl]-but-2-enyl}-carbamic acid tert-butyl ester : (0.1 chloroform)
SMILES CC(C)C[C@H](NC(=O)C[C@@H](O)C(CC1CCCCC1)NC(=O)C\C=C\[C@H](Cc1ccccc1)NC(=O)OC(C)(C)C)C(=O)NCc1ccccc1
InChI Key InChIKey=XYBBWDRNDWZJPA-RUKGNQIQSA-N
Data  1 IC50
  Tab Delimited (TSV)   2D SDfile   Computed 3D by Vconf -m prep SDfile
Find this compound or compounds like it in BindingDB:
Activity Spreadsheet -- Enzyme Inhibition Constant Data from BindingDB
Found 1 hit for monomerid = 50016040
TargetRenin(Homo sapiens (Human))
Warner-Lambert
Curated by ChEMBL
LigandPNGBDBM50016040(CHEMBL435076 | {1-Benzyl-4-[3-(1-benzylcarbamoyl-3...)
Affinity DataIC50:  1.30E+3nM. Assay description: Inhibitory activity against human renin
In DepthDetails ArticlePubMed