BDBM50016135 CHEMBL3261245
SMILES OC(=O)c1sc(nc1-c1ccccc1)-c1ccncc1
InChI Key InChIKey=XIUFXYLUJWNFRF-UHFFFAOYSA-N
Data  2 IC50
  Tab Delimited (TSV)   2D SDfile   Computed 3D by Vconf -m prep SDfile
Find this compound or compounds like it in BindingDB:
Activity Spreadsheet -- Enzyme Inhibition Constant Data from BindingDB
Found 2 hits for monomerid = 50016135
TargetCyclin-dependent kinase 2/G1/S-specific cyclin-E1(Homo sapiens (Human))
Amgen
Curated by ChEMBL
LigandPNGBDBM50016135(CHEMBL3261245)
Affinity DataIC50: >1.25E+5nM. Assay description: Inhibition of CDK2/Cyclin-E (unknown origin) using maltose binding protein as substrate by HTRF assay
In DepthDetails ArticlePubMed
LigandPNGBDBM50016135(CHEMBL3261245)
Affinity DataIC50:  172nM. Assay description: Inhibition of Cdc7/Dbf4 (unknown origin)-mediated phosphorylation of MCM2 by protein-A luminescent proximity homogenous assay
In DepthDetails ArticlePubMed