BDBM50016315 CHEMBL437631::[Val4MeAla7]AVP (Arginine-vasopressin )
SMILES CC(C)[C@H]1NC(=O)[C@H](Cc2ccccc2)NC(=O)[C@@H](Cc2ccc(O)cc2)NC(=O)CCSSC[C@H](NC(=O)[C@H](CC(N)=O)NC1=O)C(=O)N(C)[C@H](C)C(=O)N[C@@H](CCCNC(N)=N)C(=O)NCC(N)=O
InChI Key InChIKey=FFHMMFXCDAAKNP-WZBMUOIOSA-N
Data  4 Kd
  Tab Delimited (TSV)   2D SDfile   Computed 3D by Vconf -m prep SDfile
Find this compound or compounds like it in BindingDB:
Activity Spreadsheet -- Enzyme Inhibition Constant Data from BindingDB
Found 4 hits for monomerid = 50016315
TargetVasopressin V2 receptor(BOVINE)
TBA
Curated by ChEMBL
LigandPNGBDBM50016315(CHEMBL437631 | [Val4MeAla7]AVP (Arginine-vasopress...)
Affinity DataKd:  33nM. Assay description: Binding affinity against plasma membrane from bovine kidney inner medulla
In DepthDetails ArticlePubMed
TargetVasopressin V1a/V1b receptor(RAT)
TBA
Curated by ChEMBL
LigandPNGBDBM50016315(CHEMBL437631 | [Val4MeAla7]AVP (Arginine-vasopress...)
Affinity DataKd:  480nM. Assay description: Binding affinity against plasma membrane from rat liver using [3H]-AVP as a radioligand
In DepthDetails ArticlePubMed
TargetVasopressin V1a/V1b receptor(RAT)
TBA
Curated by ChEMBL
LigandPNGBDBM50016315(CHEMBL437631 | [Val4MeAla7]AVP (Arginine-vasopress...)
Affinity DataKd:  310nM. Assay description: Binding affinity against plasma membrane from bovine kidney inner medulla using [3H]-AVP as a radioligand
In DepthDetails ArticlePubMed
TargetVasopressin V2 receptor(BOVINE)
TBA
Curated by ChEMBL
LigandPNGBDBM50016315(CHEMBL437631 | [Val4MeAla7]AVP (Arginine-vasopress...)
Affinity DataKd:  30nM. Assay description: Binding affinity against plasma membrane from bovine kidney inner medulla using [3H]-AVP as a radioligand
In DepthDetails ArticlePubMed