BDBM50016676 CHEMBL293264::N-Hydroxy-4-(4-methoxy-phenyl)-N-phenethyl-butyramide
SMILES COc1ccc(CCCC(=O)N(O)CCc2ccccc2)cc1
InChI Key InChIKey=KQWFHBABTNKSHN-UHFFFAOYSA-N
Data  3 IC50
  Tab Delimited (TSV)   2D SDfile   Computed 3D by Vconf -m prep SDfile
Find this compound or compounds like it in BindingDB:
Activity Spreadsheet -- Enzyme Inhibition Constant Data from BindingDB
Found 3 hits for monomerid = 50016676
TargetPolyunsaturated fatty acid lipoxygenase ALOX15(Rattus norvegicus)
Rorer Central Research
Curated by ChEMBL
LigandPNGBDBM50016676(CHEMBL293264 | N-Hydroxy-4-(4-methoxy-phenyl)-N-ph...)
Affinity DataIC50:  2.50E+3nM. Assay description: Invitro inhibition of rat platelet 12-lipoxygenase
In DepthDetails ArticlePubMed
TargetPolyunsaturated fatty acid 5-lipoxygenase(Homo sapiens (Human))
Rorer Central Research
Curated by ChEMBL
LigandPNGBDBM50016676(CHEMBL293264 | N-Hydroxy-4-(4-methoxy-phenyl)-N-ph...)
Affinity DataIC50:  250nM. Assay description: Invitro inhibition of polymorphonuclear leukocyte derived human 5-lipoxygenase
In DepthDetails ArticlePubMed
TargetPolyunsaturated fatty acid 5-lipoxygenase(Rattus norvegicus)
Rorer Central Research
Curated by ChEMBL
LigandPNGBDBM50016676(CHEMBL293264 | N-Hydroxy-4-(4-methoxy-phenyl)-N-ph...)
Affinity DataIC50:  120nM. Assay description: In vitro inhibition of rat polymorphonuclear leukocyte 5-lipoxygenase
In DepthDetails ArticlePubMed