BDBM50016749 20-Benzyl-14-carbamoylmethyl-23-(4-ethoxy-benzyl)-17-isopropyl-13,16,19,22,25-pentaoxo-7,9-dithia-12,15,18,21,24-pentaaza-spiro[5.20]hexacosane-11-carboxylic acid (4-amino-butyl)-amide::CHEMBL339073
SMILES CCOc1ccc(C[C@H]2NC(=O)CC3(CCCCC3)SCSC[C@@H](NC(=O)[C@@H](CC(N)=O)NC(=O)[C@@H](NC(=O)[C@@H](Cc3ccccc3)NC2=O)C(C)C)C(=O)NCCCCN)cc1
InChI Key InChIKey=LWTPRZLMWCNEJJ-DMRKQDHBSA-N
Data  1 KI
  Tab Delimited (TSV)   2D SDfile   Computed 3D by Vconf -m prep SDfile
Find this compound or compounds like it in BindingDB:
Activity Spreadsheet -- Enzyme Inhibition Constant Data from BindingDB
Found 1 hit for monomerid = 50016749
TargetVasopressin V2 receptor(Sus scrofa)
Smith Kline & French Laboratories
Curated by ChEMBL
LigandPNGBDBM50016749(20-Benzyl-14-carbamoylmethyl-23-(4-ethoxy-benzyl)-...)
Affinity DataKi:  27nM. Assay description: Inhibition constant for vasopressin-stimulated adenylate cyclase of medullary membranes of pig kidney (Vasopressin V2 receptor)
In DepthDetails ArticlePubMed