BDBM50016898 1-Propyl-2,3,4,4a,10,10a-hexahydro-1H-9-oxa-1-aza-phenanthrene::CHEMBL163532
SMILES CCCN1CCC[C@H]2[C@H]1COc1ccccc21
InChI Key InChIKey=QZAIELPUDDKTFH-TZMCWYRMSA-N
Data  3 IC50
  Tab Delimited (TSV)   2D SDfile   Computed 3D by Vconf -m prep SDfile
Find this compound or compounds like it in BindingDB:
Activity Spreadsheet -- Enzyme Inhibition Constant Data from BindingDB
Found 3 hits for monomerid = 50016898
TargetAlpha-2A adrenergic receptor(BOVINE)
Ciba-Geigy
Curated by ChEMBL
LigandPNGBDBM50016898(1-Propyl-2,3,4,4a,10,10a-hexahydro-1H-9-oxa-1-aza-...)
Affinity DataIC50:  88nM. Assay description: Concentration necessary to achieve half maximal inhibition of [3H]-clonidine binding to alpha-2 adrenergic receptor at 1 uM
In DepthDetails ArticlePubMed
TargetSerotonin 2 (5-HT2) receptor(RAT)
Ciba-Geigy
Curated by ChEMBL
LigandPNGBDBM50016898(1-Propyl-2,3,4,4a,10,10a-hexahydro-1H-9-oxa-1-aza-...)
Affinity DataIC50:  178nM. Assay description: Concentration necessary to achieve half maximal inhibition of [3H]ketanserin, binds to 5-hydroxytryptamine 2 receptor at 1 uM
In DepthDetails ArticlePubMed
Target5-hydroxytryptamine receptor 1A(Rattus norvegicus (rat))
Ciba-Geigy
Curated by ChEMBL
LigandPNGBDBM50016898(1-Propyl-2,3,4,4a,10,10a-hexahydro-1H-9-oxa-1-aza-...)
Affinity DataIC50:  219nM. Assay description: Concentration necessary to achieve half maximal inhibition of [3H]-8-Hydroxy-2-(di-n-propylamino)tetralin binding to 5-hydroxytryptamine 1A receptor ...
In DepthDetails ArticlePubMed