BDBM50016905 CHEMBL3273010
SMILES CNC(=O)[C@H](C)OC(=O)N(C)NC(=O)[C@@H]1CCCN1C(=O)[C@H](C)NC(=O)[C@H](C)NC(C)=O
InChI Key InChIKey=MUUYPWITCNTAAL-MNXVOIDGSA-N
Data  1 KI
  Tab Delimited (TSV)   2D SDfile   Computed 3D by Vconf -m prep SDfile
Find this compound or compounds like it in BindingDB:
Activity Spreadsheet -- Enzyme Inhibition Constant Data from BindingDB
Found 1 hit for monomerid = 50016905
TargetNeutrophil elastase(Homo sapiens (Human))
TBA
Curated by ChEMBL
LigandPNGBDBM50016905(CHEMBL3273010)
Affinity DataKi:  3.60E+4nM. Assay description: Noncompetitive inhibition of human granulocyte elastase using Ac-Ala-Ala-Pro-Ala-p-nitroanilide as substrate by Dixon plot analysis
In DepthDetails ArticlePubMed