BDBM50016929 CHEMBL3273011
SMILES C[C@H](NC(C)=O)C(=O)N[C@@H](C)C(=O)N1CCC[C@H]1C(=O)NN(C)C(=O)O[C@@H](C)C(=O)Nc1ccccc1
InChI Key InChIKey=FKSFHRUGVPSHFV-FPXQBCRKSA-N
Data  1 KI
  Tab Delimited (TSV)   2D SDfile   Computed 3D by Vconf -m prep SDfile
Find this compound or compounds like it in BindingDB:
Activity Spreadsheet -- Enzyme Inhibition Constant Data from BindingDB
Found 1 hit for monomerid = 50016929
TargetNeutrophil elastase(Homo sapiens (Human))
TBA
Curated by ChEMBL
LigandPNGBDBM50016929(CHEMBL3273011)
Affinity DataKi:  3.90E+4nM. Assay description: Noncompetitive inhibition of human granulocyte elastase using Ac-Ala-Ala-Pro-Ala-p-nitroanilide as substrate by Dixon plot analysis
In DepthDetails ArticlePubMed