BDBM50016994 2-Benzyl-7-chloro-3-methyl-5-propyl-benzofuran-4-ol::CHEMBL18820
SMILES CCCc1cc(Cl)c2oc(Cc3ccccc3)c(C)c2c1O
InChI Key InChIKey=VZPLFUAZRDREGR-UHFFFAOYSA-N
Data  1 IC50
  Tab Delimited (TSV)   2D SDfile   Computed 3D by Vconf -m prep SDfile
Find this compound or compounds like it in BindingDB:
Activity Spreadsheet -- Enzyme Inhibition Constant Data from BindingDB
Found 1 hit for monomerid = 50016994
TargetPolyunsaturated fatty acid 5-lipoxygenase(Homo sapiens (Human))
Merck Frosst Canada
Curated by ChEMBL
LigandPNGBDBM50016994(2-Benzyl-7-chloro-3-methyl-5-propyl-benzofuran-4-o...)
Affinity DataIC50:  30nM. Assay description: Concentration required for 50 % inhibition of leukotriene B4 production in human PMN compared with controls in the absence of compound
In DepthDetails ArticlePubMed