BDBM50017115 4-[4-Methoxy-3-(2-methyl-butoxy)-phenyl]-pyrrolidin-2-one::CHEMBL32155
SMILES CCC(C)COc1cc(ccc1OC)C1CNC(=O)C1
InChI Key InChIKey=CTBFKVULAKMSGK-UHFFFAOYSA-N
Data  3 IC50
  Tab Delimited (TSV)   2D SDfile   Computed 3D by Vconf -m prep SDfile
Find this compound or compounds like it in BindingDB:
Activity Spreadsheet -- Enzyme Inhibition Constant Data from BindingDB
Found 3 hits for monomerid = 50017115
TargetcGMP-specific 3',5'-cyclic phosphodiesterase(Bos taurus)
Centre De Neurochimie Du Cnrs
Curated by ChEMBL
LigandPNGBDBM50017115(4-[4-Methoxy-3-(2-methyl-butoxy)-phenyl]-pyrrolidi...)
Affinity DataIC50:  2.00E+5nM. Assay description: Inhibitory activity against phosphodiesterase was determined in vitro using bovine aorta, at 1 uM cGMP for cGMP-PDE.
In DepthDetails ArticlePubMed
TargetcAMP-specific 3',5'-cyclic phosphodiesterase 4A/4B/4C/4D(Homo sapiens (Human))
Centre De Neurochimie Du Cnrs
Curated by ChEMBL
LigandPNGBDBM50017115(4-[4-Methoxy-3-(2-methyl-butoxy)-phenyl]-pyrrolidi...)
Affinity DataIC50:  4.60E+4nM. Assay description: Inhibitory activity against phosphodiesterase was determined in vitro using bovine aorta, at 1 uM cAMP for cAMP-PDE.
In DepthDetails ArticlePubMed
LigandPNGBDBM50017115(4-[4-Methoxy-3-(2-methyl-butoxy)-phenyl]-pyrrolidi...)
Affinity DataIC50: >1.00E+6nM. Assay description: Inhibitory activity against phosphodiesterase was determined in vitro using bovine aorta, at 1 uM cGMP in the presence of calcium (10 uM) and calmodu...
In DepthDetails ArticlePubMed