BDBM50017162 CHEMBL3287340
SMILES CC(=O)N[C@@H](CCCNC(N)=N)C(=O)N[C@H](Cc1ccc(I)cc1)C(=O)N1Cc2ccccc2CC1C(=O)N[C@@H](Cc1ccc(I)cc1)C(N)=O
InChI Key InChIKey=PWZJAZOJNHGNAE-KJZFSMDESA-N
Data  1 EC50
  Tab Delimited (TSV)   2D SDfile   Computed 3D by Vconf -m prep SDfile
Find this compound or compounds like it in BindingDB:
Activity Spreadsheet -- Enzyme Inhibition Constant Data from BindingDB
Found 1 hit for monomerid = 50017162
TargetMelanocortin receptor 4(Homo sapiens (Human))
University Of Florida
Curated by ChEMBL
LigandPNGBDBM50017162(CHEMBL3287340)
Affinity DataEC50:  203nM. Assay description: Agonist activity at wild type human melanocortin-4 receptor expressed in HEK293 cells co-transfected with CRE/beta-galactosidase reporter gene assess...
In DepthDetails ArticlePubMed