BDBM50017381 7-Fluoro-9a-methoxy-1,2,3,4,4a,9a-hexahydro-fluoren-9-one O-{3-[2-(3,5-dimethoxy-phenyl)-ethylamino]-2-hydroxy-propyl}-oxime::CHEMBL109292
SMILES COc1cc(CCNCC(O)CO\N=C2\c3cc(F)ccc3C3CCCCC23OC)cc(OC)c1
InChI Key InChIKey=DQAREIHZOIODGI-BXVZCJGGSA-N
Data  2 IC50
  Tab Delimited (TSV)   2D SDfile   Computed 3D by Vconf -m prep SDfile
Find this compound or compounds like it in BindingDB:
Activity Spreadsheet -- Enzyme Inhibition Constant Data from BindingDB
Found 2 hits for monomerid = 50017381
TargetBeta-2 adrenergic receptor(GUINEA PIG)
Université
Curated by ChEMBL
LigandPNGBDBM50017381(7-Fluoro-9a-methoxy-1,2,3,4,4a,9a-hexahydro-fluore...)
Affinity DataIC50: >1.00E+4nM. Assay description: Beta-2 adrenergic receptor blocking was assessed from 50% inhibition of the isoproterenol submaximal response on isolated Guinea pig trachea(IT)
In DepthDetails ArticlePubMed
TargetBeta-1 adrenergic receptor(GUINEA PIG)
Université
Curated by ChEMBL
LigandPNGBDBM50017381(7-Fluoro-9a-methoxy-1,2,3,4,4a,9a-hexahydro-fluore...)
Affinity DataIC50: >1.00E+4nM. Assay description: Beta-1 adrenergic receptor blocking was assessed from 50% inhibition of the isoproterenol submaximal response on isolated Guinea pig atria(IA)
In DepthDetails ArticlePubMed