BDBM50017574 CHEMBL3288328
SMILES [Cl-].COc1ccc2c(c1)c[n+](C)c1ccc(Cl)cc21
InChI Key InChIKey=PSVRELOQFNHYPZ-UHFFFAOYSA-M
Data  1 IC50
  Tab Delimited (TSV)   2D SDfile   Computed 3D by Vconf -m prep SDfile
Find this compound or compounds like it in BindingDB:
Activity Spreadsheet -- Enzyme Inhibition Constant Data from BindingDB
Found 1 hit for monomerid = 50017574
TargetAromatic-L-amino-acid decarboxylase(Homo sapiens (Human))
Hunan Agricultural University
Curated by ChEMBL
LigandPNGBDBM50017574(CHEMBL3288328)
Affinity DataIC50:  9.30E+5nM. Assay description: Inhibition of recombinant human DOPA decarboxylase assessed as inhibition of dopamine production after 30 mins by HPLC method
In DepthDetails ArticlePubMed