BDBM50017739 2-Benzyl-4-(2-carboxy-ethylcarbamoyl)-5-phenyl-pentanoic acid ethyl ester::CHEMBL86222
SMILES CCOC(=O)C(CC(Cc1ccccc1)C(=O)NCCC(O)=O)Cc1ccccc1
InChI Key InChIKey=BOKZFCGMBRCCGJ-UHFFFAOYSA-N
Data  1 IC50
  Tab Delimited (TSV)   2D SDfile   Computed 3D by Vconf -m prep SDfile
Find this compound or compounds like it in BindingDB:
Activity Spreadsheet -- Enzyme Inhibition Constant Data from BindingDB
Found 1 hit for monomerid = 50017739
TargetNeprilysin(Rattus norvegicus (Rat))
Ciba-Geigy
Curated by ChEMBL
LigandPNGBDBM50017739(2-Benzyl-4-(2-carboxy-ethylcarbamoyl)-5-phenyl-pen...)
Affinity DataIC50: >1.00E+3nM. Assay description: Inhibition of enkephalinase activity in synaptic membranes prepared from rat striatum
In DepthDetails ArticlePubMed