BDBM50017745 CHEMBL421724::disodium 2-benzyl-4-[1-carboxylato-2-(1H-3-indolyl)ethylcarbamoyl]-5-phenyl-(2S,4S)-pentanoate
SMILES [O-]C(=O)[C@@H](C[C@@H](Cc1ccccc1)C(=O)NC(Cc1c[nH]c2ccccc12)C([O-])=O)Cc1ccccc1
InChI Key InChIKey=ZJZMDMIRZXEQES-WVJBAYLNSA-L
Data  1 IC50
  Tab Delimited (TSV)   2D SDfile   Computed 3D by Vconf -m prep SDfile
Find this compound or compounds like it in BindingDB:
Activity Spreadsheet -- Enzyme Inhibition Constant Data from BindingDB
Found 1 hit for monomerid = 50017745
TargetNeprilysin(Rattus norvegicus (Rat))
Ciba-Geigy
Curated by ChEMBL
LigandPNGBDBM50017745(CHEMBL421724 | disodium 2-benzyl-4-[1-carboxylato-...)
Affinity DataIC50:  74nM. Assay description: Inhibition of enkephalinase activity in synaptic membranes prepared from rat striatum
In DepthDetails ArticlePubMed