BDBM50017934 CHEMBL3289301
SMILES N[C@H]1CC[C@@H](CC1)NC(=O)c1cc(OCc2cccc(c2)C(N)=N)cc(OCc2cccc(c2)C(N)=N)c1
InChI Key InChIKey=UKPKEJBTCDGYRU-RQNOJGIXSA-N
Data  3 KI
PDB links: 1 PDB ID matches this monomer.
  Tab Delimited (TSV)   2D SDfile   Computed 3D by Vconf -m prep SDfile
Find this compound or compounds like it in BindingDB:
Activity Spreadsheet -- Enzyme Inhibition Constant Data from BindingDB
Found 3 hits for monomerid = 50017934
TargetSuppressor of tumorigenicity 14 protein(Homo sapiens (Human))
Aurigene Discovery Technologies
Curated by ChEMBL
LigandPNGBDBM50017934(CHEMBL3289301)
Affinity DataKi:  3nM. Assay description: Inhibition of recombinant matriptase (unknown origin) using Boc-Gln-Ala-Arg-7-amido-4-methyl coumarin hydrobromide
TargetCoagulation factor X(Bos taurus)
Aurigene Discovery Technologies
Curated by ChEMBL
LigandPNGBDBM50017934(CHEMBL3289301)
Affinity DataKi:  157nM. Assay description: Inhibition of bovine plasma factor 10a using CH3OCO-D-CHA-Gly-Arg-pNA.AcoH substrate
In DepthDetails ArticlePubMed
TargetProthrombin(Homo sapiens (Human))
Aurigene Discovery Technologies
Curated by ChEMBL
LigandPNGBDBM50017934(CHEMBL3289301)
Affinity DataKi:  1.29E+3nM. Assay description: Inhibition of human thrombin using Boc-Gln-Ala-Arg-7-amido-4-methyl coumarin hydrobromide
In DepthDetails ArticlePubMed