BDBM50017967 CHEMBL3289643
SMILES Clc1ccc(cc1)N1CCN(CCC2Cc3ccccc3C2=O)CC1
InChI Key InChIKey=CPFAMVVFLCOFSK-UHFFFAOYSA-N
Data  4 KI
  Tab Delimited (TSV)   2D SDfile   Computed 3D by Vconf -m prep SDfile
Find this compound or compounds like it in BindingDB:
Activity Spreadsheet -- Enzyme Inhibition Constant Data from BindingDB
Found 4 hits for monomerid = 50017967
TargetD(4) dopamine receptor(RAT)
Florida A&M University
Curated by ChEMBL
LigandPNGBDBM50017967(CHEMBL3289643)
Affinity DataKi:  36nM. Assay description: Displacement of [3H]N-methylspiperone from rat dopamine D4 receptor by PDSP assay
In DepthDetails ArticlePubMed
TargetD(1A) dopamine receptor(Homo sapiens (Human))
Florida A&M University
Curated by ChEMBL
LigandPNGBDBM50017967(CHEMBL3289643)
Affinity DataKi:  1.70E+3nM. Assay description: Displacement of [3H]SCH23390 from human dopamine D1 receptor by PDSP assay
In DepthDetails ArticlePubMed
TargetD(3) dopamine receptor(Homo sapiens (Human))
Florida A&M University
Curated by ChEMBL
LigandPNGBDBM50017967(CHEMBL3289643)
Affinity DataKi:  4.53E+3nM. Assay description: Displacement of [3H]N-methylspiperone from human dopamine D3 receptor by PDSP assay
In DepthDetails ArticlePubMed
TargetD(2) dopamine receptor(Homo sapiens (Human))
Florida A&M University
Curated by ChEMBL
LigandPNGBDBM50017967(CHEMBL3289643)
Affinity DataKi: >1.00E+4nM. Assay description: Displacement of [3H]N-methylspiperone from human dopamine D2 receptor by PDSP assay
In DepthDetails ArticlePubMed