BDBM50017993 CHEMBL9542::N-[2-(2-Bromo-acetylamino)-ethyl]-2-[4-(2,6-dioxo-1,3-dipropyl-2,3,6,7-tetrahydro-1H-purin-8-yl)-phenoxy]-acetamide
SMILES CCCn1c2nc([nH]c2c(=O)n(CCC)c1=O)-c1ccc(OCC(=O)NCCNC(=O)CBr)cc1
InChI Key InChIKey=UBCFRLRABDBVAZ-UHFFFAOYSA-N
Data  1 KI
  Tab Delimited (TSV)   2D SDfile   Computed 3D by Vconf -m prep SDfile
Find this compound or compounds like it in BindingDB:
Activity Spreadsheet -- Enzyme Inhibition Constant Data from BindingDB
Found 1 hit for monomerid = 50017993
TargetAdenosine receptor A1(Rattus norvegicus (rat))
Niddk
Curated by ChEMBL
LigandPNGBDBM50017993(CHEMBL9542 | N-[2-(2-Bromo-acetylamino)-ethyl]-2-[...)
Affinity DataKi:  18nM. Assay description: Affinity for adenosine A1 receptor using [3H]N6-(phenylisopropyl)adenosine (R)-[3H]-PIA as a radioligand in rat brain.
In DepthDetails ArticlePubMed