BDBM50018206 CHEMBL3289993
SMILES Fc1ccc2c(noc2c1)C1CCN(CCCNS(=O)(=O)c2ccc(Cl)c(Cl)c2)CC1
InChI Key InChIKey=WASWXYVTAUBCDE-UHFFFAOYSA-N
Data  4 KI
  Tab Delimited (TSV)   2D SDfile   Computed 3D by Vconf -m prep SDfile
Find this compound or compounds like it in BindingDB:
Activity Spreadsheet -- Enzyme Inhibition Constant Data from BindingDB
Found 4 hits for monomerid = 50018206
Target5-hydroxytryptamine receptor 7(Homo sapiens (Human))
Adamed
Curated by ChEMBL
LigandPNGBDBM50018206(CHEMBL3289993)
Affinity DataKi:  1.20nM. Assay description: Displacement of [3H]LSD from human recombinant 5-HT7 receptor expressed in CHO-K1 cell membrane after 120 mins by liquid scintillation counting analy...
In DepthDetails ArticlePubMed
Target5-hydroxytryptamine receptor 2A(Homo sapiens (Human))
Adamed
Curated by ChEMBL
LigandPNGBDBM50018206(CHEMBL3289993)
Affinity DataKi:  2.20nM. Assay description: Displacement of [3H]ketanserin from human recombinant 5-HT2A receptor expressed in CHO-K1 cell membrane after 60 mins by liquid scintillation countin...
In DepthDetails ArticlePubMed
Target5-hydroxytryptamine receptor 6(Homo sapiens (Human))
Adamed
Curated by ChEMBL
LigandPNGBDBM50018206(CHEMBL3289993)
Affinity DataKi:  7.10nM. Assay description: Displacement of [3H]LSDm from human recombinant 5-HT6 receptor expressed in HEK293 cell membrane after 60 mins by liquid scintillation counting analy...
In DepthDetails ArticlePubMed
TargetD(2) dopamine receptor(Homo sapiens (Human))
Adamed
Curated by ChEMBL
LigandPNGBDBM50018206(CHEMBL3289993)
Affinity DataKi:  14nM. Assay description: Displacement of [3H]N-methylspiperone from human recombinant D2 receptor expressed in CHO-K1 cell membrane after 60 mins by liquid scintillation coun...
In DepthDetails ArticlePubMed