BDBM50018222 CHEMBL3290000
SMILES Fc1ccc2c(noc2c1)C1CCN(CCCCNS(=O)(=O)c2cccs2)CC1
InChI Key InChIKey=BDBDYFWUCQEXEB-UHFFFAOYSA-N
Data  4 KI
  Tab Delimited (TSV)   2D SDfile   Computed 3D by Vconf -m prep SDfile
Find this compound or compounds like it in BindingDB:
Activity Spreadsheet -- Enzyme Inhibition Constant Data from BindingDB
Found 4 hits for monomerid = 50018222
Target5-hydroxytryptamine receptor 7(Homo sapiens (Human))
Adamed
Curated by ChEMBL
LigandPNGBDBM50018222(CHEMBL3290000)
Affinity DataKi:  6.30nM. Assay description: Displacement of [3H]LSD from human recombinant 5-HT7 receptor expressed in CHO-K1 cell membrane after 120 mins by liquid scintillation counting analy...
In DepthDetails ArticlePubMed
Target5-hydroxytryptamine receptor 2A(Homo sapiens (Human))
Adamed
Curated by ChEMBL
LigandPNGBDBM50018222(CHEMBL3290000)
Affinity DataKi:  9.5nM. Assay description: Displacement of [3H]ketanserin from human recombinant 5-HT2A receptor expressed in CHO-K1 cell membrane after 60 mins by liquid scintillation countin...
In DepthDetails ArticlePubMed
Target5-hydroxytryptamine receptor 6(Homo sapiens (Human))
Adamed
Curated by ChEMBL
LigandPNGBDBM50018222(CHEMBL3290000)
Affinity DataKi:  130nM. Assay description: Displacement of [3H]LSDm from human recombinant 5-HT6 receptor expressed in HEK293 cell membrane after 60 mins by liquid scintillation counting analy...
In DepthDetails ArticlePubMed
TargetD(2) dopamine receptor(Homo sapiens (Human))
Adamed
Curated by ChEMBL
LigandPNGBDBM50018222(CHEMBL3290000)
Affinity DataKi: >1.00E+3nM. Assay description: Displacement of [3H]N-methylspiperone from human recombinant D2 receptor expressed in CHO-K1 cell membrane after 60 mins by liquid scintillation coun...
In DepthDetails ArticlePubMed