BDBM50018269 CHEMBL488336
SMILES CC(=O)c1nc(c[nH]1)[C@@H](O)[C@H](O)[C@H](O)CO
InChI Key InChIKey=CQSIXFHVGKMLGQ-BWZBUEFSSA-N
Data  1 IC50
  Tab Delimited (TSV)   2D SDfile   Computed 3D by Vconf -m prep SDfile
Find this compound or compounds like it in BindingDB:
Activity Spreadsheet -- Enzyme Inhibition Constant Data from BindingDB
Found 1 hit for monomerid = 50018269
TargetSphingosine-1-phosphate lyase 1(Homo sapiens (Human))
Novartis Institutes For Biomedical Research
Curated by ChEMBL
LigandPNGBDBM50018269(CHEMBL488336)
Affinity DataIC50: >1.00E+5nM. Assay description: Inhibition of S1PL (unknown origin)
In DepthDetails ArticlePubMed