BDBM50018346 5,5-Bis-(4-fluoro-phenyl)-penta-2,4-dienoic acid (1-methyl-4-pyridin-3-yl-butyl)-amide::CHEMBL299780
SMILES [#6]-[#6@@H](-[#6]-[#6]-[#6]-c1cccnc1)-[#7]-[#6](=O)\[#6]=[#6]\[#6]=[#6](\c1ccc(F)cc1)-c1ccc(F)cc1
InChI Key InChIKey=AYVHAGIUGRHDQX-UTJZZEGQSA-N
Data  1 IC50
  Tab Delimited (TSV)   2D SDfile   Computed 3D by Vconf -m prep SDfile
Find this compound or compounds like it in BindingDB:
Activity Spreadsheet -- Enzyme Inhibition Constant Data from BindingDB
Found 1 hit for monomerid = 50018346
TargetPlatelet-activating factor receptor(Homo sapiens (Human))
Roche Research Center
Curated by ChEMBL
LigandPNGBDBM50018346(5,5-Bis-(4-fluoro-phenyl)-penta-2,4-dienoic acid (...)
Affinity DataIC50:  275nM. Assay description: Inhibition of platelet activating factor receptor binding activity in dog platelets using [3H]-PAF as radioligand
In DepthDetails ArticlePubMed